Target
Growth hormone secretagogue receptor type 1
Ligand
BDBM19392
Substrate
125I-His9-ghrelin
Meas. Tech.
Receptor Binding Studies and GHS-R Ca2+ Flux Assay
pH
7.4±n/a
Temperature
295.15±n/a K
IC50
2.9±n/a nM
EC50
97±19 nM
Citation
 Serby, MDZhao, HSzczepankiewicz, BGKosogof, CXin, ZLiu, BLiu, MNelson, LTKaszubska, WFalls, HDSchaefer, VBush, ENShapiro, RDroz, BAKnourek-Segel, VEFey, TABrune, MEBeno, DWTurner, TMCollins, CAJacobson, PBSham, HLLiu, G 2,4-diaminopyrimidine derivatives as potent growth hormone secretagogue receptor antagonists. J Med Chem 49:2568-78 (2006)  
Target
Name:
Growth hormone secretagogue receptor type 1
Synonyms:
GH-releasing peptide receptor GHS-R GHSR_HUMAN Ghrelin receptor | Ghrelin receptor 1a (GHS-R1a)
Type:
Receptor
Mol. Mass.:
41334.57
Organism:
Homo sapiens (Human)
Description:
Receptor binding studies use plasma membranes from LLC PK-1 cells transiently transfected with hGHSR1a.
Residue:
366
  
Inhibitor
Name:
BDBM19392
Synonyms:
2,4-diaminopyrimidine derivative, 8h | 6-[(benzyloxy)methyl]-5-[4-({[4-(trifluoromethyl)phenyl]methyl}amino)phenyl]pyrimidine-2,4-diamine
Type:
Small organic molecule
Emp. Form.:
C26H24F3N5O
Mol. Mass.:
479.4969
SMILES:
Nc1nc(N)c(c(COCc2ccccc2)n1)-c1ccc(NCc2ccc(cc2)C(F)(F)F)cc1
:
Substrate
Name:
125I-His9-ghrelin
Synonyms:
radiolabeled peptide ligand
Type:
Peptide
Mol. Mass.:
9033.11
Organism:
Description:
Residue:
82