Target
Muscarinic acetylcholine receptor M1
Ligand
BDBM361607
Substrate
Meas. Tech.
Cell-Based Functional Assay of Muscarinic Acetylcholine Receptor
EC50
30000±n/a nM
Citation
 Conn, PJLindsley, CWEmmitte, KAHan, CEngers, JLBender, AM Substituted pyrrolo[3,4-e]indolizines, imidazo[1,2-a]pyrrolo[3,4-e]pyridines, pyrrolo[3,4-e][1,2,4]triazolo[1,5-a]pyridines and pyrrolo[3,4-e][1,2,4]triazolo[4,3-a]pyridines as positive allosteric modulators of muscarinic acetylcholine receptor M1 US Patent  US10221175 Publication Date 3/5/2019 
Target
Name:
Muscarinic acetylcholine receptor M1
Synonyms:
ACM1_HUMAN Cholinergic receptor, muscarinic 1 | Cholinergic, muscarinic M1
Type:
Protein
Mol. Mass.:
51442.54
Organism:
Homo sapiens (Human)
Description:
P11229
Residue:
460
  
Inhibitor
Name:
BDBM361607
Synonyms:
US10221175, Compound 12
Type:
Small organic molecule
Emp. Form.:
C18H13FN6O
Mol. Mass.:
348.3338
SMILES:
Fc1cc(ccc1CN1Cc2ccc3nncn3c2C1=O)-n1cccn1
: