Target
Muscarinic acetylcholine receptor M1
Ligand
BDBM361634
Substrate
Meas. Tech.
Cell-Based Functional Assay of Muscarinic Acetylcholine Receptor
EC50
857±n/a nM
Citation
 Conn, PJLindsley, CWEmmitte, KAHan, CEngers, JLBender, AM Substituted pyrrolo[3,4-e]indolizines, imidazo[1,2-a]pyrrolo[3,4-e]pyridines, pyrrolo[3,4-e][1,2,4]triazolo[1,5-a]pyridines and pyrrolo[3,4-e][1,2,4]triazolo[4,3-a]pyridines as positive allosteric modulators of muscarinic acetylcholine receptor M1 US Patent  US10221175 Publication Date 3/5/2019 
Target
Name:
Muscarinic acetylcholine receptor M1
Synonyms:
ACM1_HUMAN Cholinergic receptor, muscarinic 1 | Cholinergic, muscarinic M1
Type:
Protein
Mol. Mass.:
51442.54
Organism:
Homo sapiens (Human)
Description:
P11229
Residue:
460
  
Inhibitor
Name:
BDBM361634
Synonyms:
US10221175, Compound 39
Type:
Small organic molecule
Emp. Form.:
C25H16F2N4O
Mol. Mass.:
426.4175
SMILES:
Fc1cc(cc(F)c1CN1Cc2ccc3nccn3c2C1=O)-c1ccc2ncccc2c1
: