Target
Histone deacetylase 2
Ligand
BDBM19428
Substrate
BDBM19411
Meas. Tech.
HDAC Enzyme Activity Assay
IC50
7±n/a nM
Citation
 Moradei, OMMallais, TCFrechette, SPaquin, ITessier, PELeit, SMFournel, MBonfils, CTrachy-Bourget, MCLiu, JYan, TPLu, AHRahil, JWang, JLefebvre, SLi, ZVaisburg, AFBesterman, JM Novel aminophenyl benzamide-type histone deacetylase inhibitors with enhanced potency and selectivity. J Med Chem 50:5543-6 (2007)  
Target
Name:
Histone deacetylase 2
Synonyms:
Cereblon/Histone deacetylase 2 HDAC2 Histone deacetylase 2 (HDAC2) | Human HDAC2
Type:
Chromatin regulator; hydrolase; repressor
Mol. Mass.:
55356.54
Organism:
Homo sapiens (Human)
Description:
Q92769
Residue:
488
  
Inhibitor
Name:
BDBM19428
Synonyms:
(2E)-N-hydroxy-3-(4-{[(2-hydroxyethyl)[2-(1H-indol-3-yl)ethyl]amino]methyl}phenyl)prop-2-enamide CHEMBL356066 LAQ-824 | NVP-LAQ824
Type:
Small organic molecule
Emp. Form.:
C22H25N3O3
Mol. Mass.:
379.4522
SMILES:
OCCN(CCc1c[nH]c2ccccc12)Cc1ccc(\C=C\C(=O)NO)cc1
:
Substrate
Name:
BDBM19411
Synonyms:
BDBM24625 fluorescent substrate
Type:
Emp. Form.:
C23H31N3O6
Mol. Mass.:
445.5087
SMILES:
CC(=O)NCCCC[C@H](NC(=O)OC(C)(C)C)C(=O)Nc1ccc2c(C)cc(=O)oc2c1
: