Target
Mitogen-activated protein kinase 1
Ligand
BDBM244099
Substrate
Meas. Tech.
Activated ERK2 Kinase Assay
pH
7.5±n/a
IC50
114±n/a nM
Comments
extracted
Citation
 Dillon, MPLindvall, MPoon, DRamurthy, SRauniyar, VShafer, CSubramanian, STanner, HR Substituted pyrrolo[3,4-d]pyrimidines as kinase inhibitors US Patent  US9546173 Publication Date 1/17/2017 
Target
Name:
Mitogen-activated protein kinase 1
Synonyms:
ERK2 Extracellular signal-regulated kinase 2 Extracellular signal-regulated kinase 2 (ERK2) MAPK 2 MK01_HUMAN Mitogen-activated protein kinase 1 (ERK-2) Mitogen-activated protein kinase 2 PRKM2 | p42-MAPK
Type:
Ser/Thr Protein Kinase
Mol. Mass.:
41392.76
Organism:
Homo sapiens (Human)
Description:
P28482
Residue:
360
  
Inhibitor
Name:
BDBM244099
Synonyms:
2-(((1r,4s)-4-cyanocyclohexyl)amino)-n-((s)-2-hydroxy-1-phenylethyl)-5,5-dimethyl-5h-pyrrolo[3,4-d]pyrimidine-6(7h)-carboxamide | US9546173, cmpd 81
Type:
Small organic molecule
Emp. Form.:
C24H30N6O2
Mol. Mass.:
434.534
SMILES:
CC1(C)N(Cc2nc(N[C@H]3CC[C@@H](CC3)C#N)ncc12)C(=O)N[C@H](CO)c1ccccc1
: