Target
Mitogen-activated protein kinase 1
Ligand
BDBM244181
Substrate
Meas. Tech.
Activated ERK2 Kinase Assay
pH
7.5±n/a
IC50
176±n/a nM
Comments
extracted
Citation
 Dillon, MPLindvall, MPoon, DRamurthy, SRauniyar, VShafer, CSubramanian, STanner, HR Substituted pyrrolo[3,4-d]pyrimidines as kinase inhibitors US Patent  US9546173 Publication Date 1/17/2017 
Target
Name:
Mitogen-activated protein kinase 1
Synonyms:
ERK2 Extracellular signal-regulated kinase 2 Extracellular signal-regulated kinase 2 (ERK2) MAPK 2 MK01_HUMAN Mitogen-activated protein kinase 1 (ERK-2) Mitogen-activated protein kinase 2 PRKM2 | p42-MAPK
Type:
Ser/Thr Protein Kinase
Mol. Mass.:
41392.76
Organism:
Homo sapiens (Human)
Description:
P28482
Residue:
360
  
Inhibitor
Name:
BDBM244181
Synonyms:
(r)-5,5-dimethyl-2-((tetrahydro-2h-pyran-4-yl)amino)-n-(1-tosylpiperidin-3-yl)-5h-pyrrolo[3,4-d]pyrimidine-6(7h)-carboxamide | US9546173, cmpd 114
Type:
Small organic molecule
Emp. Form.:
C26H36N6O4S
Mol. Mass.:
528.667
SMILES:
Cc1ccc(cc1)S(=O)(=O)N1CCC[C@H](C1)NC(=O)N1Cc2nc(NC3CCOCC3)ncc2C1(C)C
: