Target
Cathepsin B
Ligand
BDBM19479
Substrate
BDBM19485
Meas. Tech.
In Vitro Enzyme Assay
pH
6.1±n/a
Temperature
310.15±n/a K
Ki
>10000±n/a nM
Citation
 Patterson, AWWood, WJHornsby, MLesley, SSpraggon, GEllman, JA Identification of selective, nonpeptidic nitrile inhibitors of cathepsin s using the substrate activity screening method. J Med Chem 49:6298-307 (2006)  
Target
Name:
Cathepsin B
Synonyms:
APP secretase CATB_HUMAN CTSB Cathepsin B light chain | Cathepsin B1
Type:
Enzyme
Mol. Mass.:
37819.69
Organism:
Homo sapiens (Human)
Description:
gi_63102437
Residue:
339
  
Inhibitor
Name:
BDBM19479
Synonyms:
1, 2, 3 -Triazole Nitrile Inhibitor, 11a | N-[(2S)-2-{1-[(1S)-1-cyanopentyl]-1H-1,2,3-triazol-4-yl}-3-methylbutan-2-yl]benzamide
Type:
Small organic molecule
Emp. Form.:
C20H27N5O
Mol. Mass.:
353.4613
SMILES:
CCCC[C@@H](C#N)n1cc(nn1)[C@@](C)(NC(=O)c1ccccc1)C(C)C
:
Substrate
Name:
BDBM19485
Synonyms:
Cbz-Phe-Arg-AMC Z-Phe-Arg-AMC.HCl
Type:
Emp. Form.:
Mol. Mass.:
SMILES:
: