Target
Procathepsin L
Ligand
BDBM19498
Substrate
BDBM19480
Meas. Tech.
Enzyme Inhibition Assay
IC50
911±n/a nM
Citation
 Gauthier, JYBlack, WCCourchesne, ICromlish, WDesmarais, SHoule, RLamontagne, SLi, CSMassé, FMcKay, DJOuellet, MRobichaud, JTruchon, JFTruong, VLWang, QPercival, MD The identification of potent, selective, and bioavailable cathepsin S inhibitors. Bioorg Med Chem Lett 17:4929-33 (2007)  
Target
Name:
Procathepsin L
Synonyms:
CATL1_HUMAN CTSL CTSL1 Cathepsin L Cathepsin L1 heavy chain MEP cathepsin L preproprotein
Type:
Enzyme
Mol. Mass.:
37557.19
Organism:
Homo sapiens (Human)
Description:
Purchased from Calbiochem (San Diego, CA).
Residue:
333
  
Inhibitor
Name:
BDBM19498
Synonyms:
(2R)-N-(1-cyanocyclopropyl)-3-methanesulfonyl-2-{[(1S)-2,2,2-trifluoro-1-(3-fluorophenyl)ethyl]amino}propanamide | trifluoroethylamine inhibitor, 8
Type:
Small organic molecule
Emp. Form.:
C16H17F4N3O3S
Mol. Mass.:
407.383
SMILES:
CS(=O)(=O)C[C@H](N[C@@H](c1cccc(F)c1)C(F)(F)F)C(=O)NC1(CC1)C#N
:
Substrate
Name:
BDBM19480
Synonyms:
Cbz-Leu-Arg-AMC Z-Leu-Arg-AMC
Type:
Emp. Form.:
Mol. Mass.:
SMILES:
: