Target
Phosphatidylinositol 4,5-bisphosphate 3-kinase catalytic subunit delta isoform
Ligand
BDBM361924
Substrate
Meas. Tech.
HTRF PI3K Biochemical Assay
IC50
31.0±n/a nM
Citation
 McGowan, MAZhou, HKatz, JDYang, LMethot, JLLipford, KAXu, SFu, NXu, GBian, DFu, JLi, YFong, KC Purine inhibitors of human phosphatidylinositol 3-kinase delta US Patent  US10221178 Publication Date 3/5/2019 
Target
Name:
Phosphatidylinositol 4,5-bisphosphate 3-kinase catalytic subunit delta isoform
Synonyms:
PI3-kinase p110 subunit delta PI3-kinase subunit p110-delta PIK3CD Phosphatidylinositol 4,5-biphosphate 3-kinase catalytic subunit delta (PIK3CD) Phosphatidylinositol 4,5-bisphosphate 3-kinase 110 kDa catalytic subunit delta (PI3K delta) Phosphatidylinositol 4,5-bisphosphate 3-kinase catalytic subunit delta (PI3Kdelta) Phosphatidylinositol 4,5-bisphosphate 3-kinase catalytic subunit delta isoform (PI3K delta) Phosphatidylinositol 4,5-bisphosphate 3-kinase catalytic subunit delta isoform (PI3K-delta) Phosphatidylinositol 4,5-bisphosphate 3-kinase catalytic subunit delta isoform (PI3Kdelta)
Type:
Enzyme Subunit
Mol. Mass.:
119489.41
Organism:
Homo sapiens (Human)
Description:
O00329
Residue:
1044
  
Inhibitor
Name:
BDBM361924
Synonyms:
9-ethyl-8-(2-methylpyrimidin-5- yl)-N-{(1S)-1-[((S and R)-3- methylpyrrolidin-1- yl)carbonyl]propyl}-9H-purin-6- amine | US10221178, Compound 2-18
Type:
Small organic molecule
Emp. Form.:
C21H28N8O
Mol. Mass.:
408.5
SMILES:
CC[C@H](Nc1ncnc2n(CC)c(nc12)-c1cnc(C)nc1)C(=O)N1CCC(C)C1
: