Target
Phosphatidylinositol 4,5-bisphosphate 3-kinase catalytic subunit delta isoform
Ligand
BDBM361952
Substrate
Meas. Tech.
HTRF PI3K Biochemical Assay
IC50
27.0±n/a nM
Citation
 McGowan, MAZhou, HKatz, JDYang, LMethot, JLLipford, KAXu, SFu, NXu, GBian, DFu, JLi, YFong, KC Purine inhibitors of human phosphatidylinositol 3-kinase delta US Patent  US10221178 Publication Date 3/5/2019 
Target
Name:
Phosphatidylinositol 4,5-bisphosphate 3-kinase catalytic subunit delta isoform
Synonyms:
PI3-kinase p110 subunit delta PI3-kinase subunit p110-delta PIK3CD Phosphatidylinositol 4,5-biphosphate 3-kinase catalytic subunit delta (PIK3CD) Phosphatidylinositol 4,5-bisphosphate 3-kinase 110 kDa catalytic subunit delta (PI3K delta) Phosphatidylinositol 4,5-bisphosphate 3-kinase catalytic subunit delta (PI3Kdelta) Phosphatidylinositol 4,5-bisphosphate 3-kinase catalytic subunit delta isoform (PI3K delta) Phosphatidylinositol 4,5-bisphosphate 3-kinase catalytic subunit delta isoform (PI3K-delta) Phosphatidylinositol 4,5-bisphosphate 3-kinase catalytic subunit delta isoform (PI3Kdelta)
Type:
Enzyme Subunit
Mol. Mass.:
119489.41
Organism:
Homo sapiens (Human)
Description:
O00329
Residue:
1044
  
Inhibitor
Name:
BDBM361952
Synonyms:
N-[(1S)-2-[(cis)-2,6- dimethylmorpholin-4-yl]-1- (methoxymethyl)-2-oxoethyl]-9- ethyl-8-(2-methylpyrimidin-5-yl)- 9H-purin-6-amine | US10221178, Compound 2-46
Type:
Small organic molecule
Emp. Form.:
C22H30N8O3
Mol. Mass.:
454.5254
SMILES:
CCn1c(nc2c(N[C@@H](COC)C(=O)N3C[C@H](C)O[C@H](C)C3)ncnc12)-c1cnc(C)nc1
: