Target
Glutamate receptor ionotropic, NMDA 2A
Ligand
BDBM361987
Substrate
Meas. Tech.
TBD
IC50
>10000±n/a nM
Citation
 Shapiro, G 3,3-difluoro-piperidine derivatives as NR2B NMDA receptor antagonists US Patent  US10221182 Publication Date 3/5/2019 
Target
Name:
Glutamate receptor ionotropic, NMDA 2A
Synonyms:
GRIN2A Glutamate [NMDA] receptor Glutamate [NMDA] receptor subunit epsilon-1 NMDA receptor subtype 2A protein (NR2A) NMDE1_HUMAN hNR2A
Type:
Mol. Mass.:
165293.76
Organism:
Homo sapiens (Human)
Description:
Residue:
1464
  
Inhibitor
Name:
BDBM361987
Synonyms:
US10221182, Compound C-3.5
Type:
Small organic molecule
Emp. Form.:
C18H18F5N7
Mol. Mass.:
427.3744
SMILES:
FC(F)(F)c1ccc(CCN2CCC(Nc3ncnc4[nH]ncc34)C(F)(F)C2)cn1
: