Target
Glutamate receptor ionotropic, NMDA 2B
Ligand
BDBM362003
Substrate
Meas. Tech.
NR2B Antagonist Activity
IC50
61.9±n/a nM
Citation
 Shapiro, G 3,3-difluoro-piperidine derivatives as NR2B NMDA receptor antagonists US Patent  US10221182 Publication Date 3/5/2019 
Target
Name:
Glutamate receptor ionotropic, NMDA 2B
Synonyms:
GRIN2B Glutamate [NMDA] receptor subunit epsilon 2 N-methyl D-aspartate receptor subtype 2B NMDAR2B NR3 | hNR3
Type:
PROTEIN
Mol. Mass.:
166375.46
Organism:
Homo sapiens (Human)
Description:
ChEMBL_1438829
Residue:
1484
  
Inhibitor
Name:
BDBM362003
Synonyms:
US10221182, Compound E1-1.16 | US10221182, Compound E2-1.16
Type:
Small organic molecule
Emp. Form.:
C18H18ClF3N6
Mol. Mass.:
410.824
SMILES:
Fc1cc(Cl)ccc1CCN1CCC(Nc2ncnc3[nH]ncc23)C(F)(F)C1
: