Target
Glutamate receptor ionotropic, NMDA 2B
Ligand
BDBM361999
Substrate
Meas. Tech.
NR2B Antagonist Activity
IC50
17.0±n/a nM
Citation
 Shapiro, G 3,3-difluoro-piperidine derivatives as NR2B NMDA receptor antagonists US Patent  US10221182 Publication Date 3/5/2019 
Target
Name:
Glutamate receptor ionotropic, NMDA 2B
Synonyms:
GRIN2B Glutamate [NMDA] receptor subunit epsilon 2 N-methyl D-aspartate receptor subtype 2B NMDAR2B NR3 | hNR3
Type:
PROTEIN
Mol. Mass.:
166375.46
Organism:
Homo sapiens (Human)
Description:
ChEMBL_1438829
Residue:
1484
  
Inhibitor
Name:
BDBM361999
Synonyms:
US10221182, Compound E1-1.6 | US10221182, Compound E2-1.6
Type:
Small organic molecule
Emp. Form.:
C19H20F4N6
Mol. Mass.:
408.3959
SMILES:
FC(F)c1ccc(CCN2CCC(Nc3ncnc4[nH]ncc34)C(F)(F)C2)cc1
: