Target
Alkaline phosphatase, tissue-nonspecific isozyme
Ligand
BDBM275045
Substrate
Meas. Tech.
Inhibitory Test of TNAP Activity
IC50
6.30±n/a nM
Citation
 Miyazaki, SYamamoto, YSuzuki, KInui, MIzumi, MSoma, KPinkerton, AShinozaki, T Pyridine compounds US Patent  US10221195 Publication Date 3/5/2019 
Target
Name:
Alkaline phosphatase, tissue-nonspecific isozyme
Synonyms:
ALPL tissue-nonspecific alkaline phosphatase precursor
Type:
PROTEIN
Mol. Mass.:
57306.17
Organism:
Homo sapiens (Human)
Description:
ChEMBL_1448917
Residue:
524
  
Inhibitor
Name:
BDBM275045
Synonyms:
5-Chloro-2-methoxy-N-(4-methyl-5-oxo-2,3,4,5-tetrahydropyrido[3,2-f][1,4]oxazepin-7-yl)benzenesulfonamide US9879032, Example 1
Type:
Small organic molecule
Emp. Form.:
C16H16ClN3O5S
Mol. Mass.:
397.833
SMILES:
COc1ccc(Cl)cc1S(=O)(=O)Nc1cnc2OCCN(C)C(=O)c2c1
: