Target
Cathepsin K
Ligand
BDBM19526
Substrate
BDBM19480
Meas. Tech.
Enzyme Inhibition Assay
IC50
0.6±n/a nM
Citation
 Li, CSDeschenes, DDesmarais, SFalgueyret, JPGauthier, JYKimmel, DBLéger, SMassé, FMcGrath, MEMcKay, DJPercival, MDRiendeau, DRodan, SBThérien, MTruong, VLWesolowski, GZamboni, RBlack, WC Identification of a potent and selective non-basic cathepsin K inhibitor. Bioorg Med Chem Lett 16:1985-9 (2006)  
Target
Name:
Cathepsin K
Synonyms:
CATK_RABIT | CTSK
Type:
Enzyme
Mol. Mass.:
36879.51
Organism:
Oryctolagus cuniculus (rabbit)
Description:
Residue:
329
  
Inhibitor
Name:
BDBM19526
Synonyms:
(2S)-N-(cyanomethyl)-4-methyl-2-{[(1S)-2,2,2-trifluoro-1-[4-(4-fluorophenyl)phenyl]ethyl]amino}pentanamide | trifluoroethylamine analogue, 15
Type:
Small organic molecule
Emp. Form.:
C22H23F4N3O
Mol. Mass.:
421.4311
SMILES:
CC(C)C[C@H](N[C@@H](c1ccc(cc1)-c1ccc(F)cc1)C(F)(F)F)C(=O)NCC#N
:
Substrate
Name:
BDBM19480
Synonyms:
Cbz-Leu-Arg-AMC Z-Leu-Arg-AMC
Type:
Emp. Form.:
Mol. Mass.:
SMILES:
: