Target
Cathepsin K
Ligand
BDBM19544
Substrate
BDBM19480
Meas. Tech.
Enzyme Inhibition Assay
IC50
<0.2±n/a nM
Citation
 Li, CSDeschenes, DDesmarais, SFalgueyret, JPGauthier, JYKimmel, DBLéger, SMassé, FMcGrath, MEMcKay, DJPercival, MDRiendeau, DRodan, SBThérien, MTruong, VLWesolowski, GZamboni, RBlack, WC Identification of a potent and selective non-basic cathepsin K inhibitor. Bioorg Med Chem Lett 16:1985-9 (2006)  
Target
Name:
Cathepsin K
Synonyms:
CATK_RABIT | CTSK
Type:
Enzyme
Mol. Mass.:
36879.51
Organism:
Oryctolagus cuniculus (rabbit)
Description:
Residue:
329
  
Inhibitor
Name:
BDBM19544
Synonyms:
(2S)-N-(cyanomethyl)-4-methyl-2-{[(1S)-2,2,2-trifluoro-1-{4-[4-(pyridin-4-yl)phenyl]phenyl}ethyl]amino}pentanamide | trifluoroethylamine analogue, 34
Type:
Small organic molecule
Emp. Form.:
C27H27F3N4O
Mol. Mass.:
480.5247
SMILES:
CC(C)C[C@H](N[C@@H](c1ccc(cc1)-c1ccc(cc1)-c1ccncc1)C(F)(F)F)C(=O)NCC#N
:
Substrate
Name:
BDBM19480
Synonyms:
Cbz-Leu-Arg-AMC Z-Leu-Arg-AMC
Type:
Emp. Form.:
Mol. Mass.:
SMILES:
: