Target
Phosphatidylinositol 4,5-bisphosphate 3-kinase catalytic subunit delta isoform
Ligand
BDBM362015
Substrate
IC50
600±n/a nM
Citation
 Du, ZEvarts, JKaplan, JKim, MNaduthambi, DPatel, LPerreault, SPhillips, BWPhillips, GStevens, KLTreiberg, JAVan Veldhuizen, JWatkins, WJYeung, SC Phosphatidylinositol 3-kinase inhibitors US Patent  US10221197 Publication Date 3/5/2019 
Target
Name:
Phosphatidylinositol 4,5-bisphosphate 3-kinase catalytic subunit delta isoform
Synonyms:
PI3-kinase p110 subunit delta PI3-kinase subunit p110-delta PIK3CD Phosphatidylinositol 4,5-biphosphate 3-kinase catalytic subunit delta (PIK3CD) Phosphatidylinositol 4,5-bisphosphate 3-kinase 110 kDa catalytic subunit delta (PI3K delta) Phosphatidylinositol 4,5-bisphosphate 3-kinase catalytic subunit delta (PI3Kdelta) Phosphatidylinositol 4,5-bisphosphate 3-kinase catalytic subunit delta isoform (PI3K delta) Phosphatidylinositol 4,5-bisphosphate 3-kinase catalytic subunit delta isoform (PI3K-delta) Phosphatidylinositol 4,5-bisphosphate 3-kinase catalytic subunit delta isoform (PI3Kdelta)
Type:
Enzyme Subunit
Mol. Mass.:
119489.41
Organism:
Homo sapiens (Human)
Description:
O00329
Residue:
1044
  
Inhibitor
Name:
BDBM362015
Synonyms:
US10221197, Compound 9
Type:
Small organic molecule
Emp. Form.:
C24H20ClN9O2
Mol. Mass.:
501.928
SMILES:
NC(=O)c1cccc(c1)-n1c(nc2cccc(Cl)c2c1=O)[C@@H](Nc1nc(N)nc(N)c1C#N)C1CC1
: