Target
Phosphatidylinositol 4,5-bisphosphate 3-kinase catalytic subunit delta isoform
Ligand
BDBM362034
Substrate
IC50
2000±n/a nM
Citation
 Du, ZEvarts, JKaplan, JKim, MNaduthambi, DPatel, LPerreault, SPhillips, BWPhillips, GStevens, KLTreiberg, JAVan Veldhuizen, JWatkins, WJYeung, SC Phosphatidylinositol 3-kinase inhibitors US Patent  US10221197 Publication Date 3/5/2019 
Target
Name:
Phosphatidylinositol 4,5-bisphosphate 3-kinase catalytic subunit delta isoform
Synonyms:
PI3-kinase p110 subunit delta PI3-kinase subunit p110-delta PIK3CD Phosphatidylinositol 4,5-biphosphate 3-kinase catalytic subunit delta (PIK3CD) Phosphatidylinositol 4,5-bisphosphate 3-kinase 110 kDa catalytic subunit delta (PI3K delta) Phosphatidylinositol 4,5-bisphosphate 3-kinase catalytic subunit delta (PI3Kdelta) Phosphatidylinositol 4,5-bisphosphate 3-kinase catalytic subunit delta isoform (PI3K delta) Phosphatidylinositol 4,5-bisphosphate 3-kinase catalytic subunit delta isoform (PI3K-delta) Phosphatidylinositol 4,5-bisphosphate 3-kinase catalytic subunit delta isoform (PI3Kdelta)
Type:
Enzyme Subunit
Mol. Mass.:
119489.41
Organism:
Homo sapiens (Human)
Description:
O00329
Residue:
1044
  
Inhibitor
Name:
BDBM362034
Synonyms:
(S)-3-(8-chloro-2-(cyclopropyl((2,6-diamino-5-cyanopyrimidin-4-yl)amino)methyl)-6-fluoro-4-oxoquinazolin-3(4H)-yl)benzamide | US10221197, Compound 27
Type:
Small organic molecule
Emp. Form.:
C23H19Cl2FN8O2
Mol. Mass.:
529.354
SMILES:
NC(=O)c1cccc(c1)-n1c(nc2c(Cl)cc(F)cc2c1=O)[C@@H](Nc1nc(N)nc(N)c1Cl)C1CC1
: