Target
C-X-C chemokine receptor type 2
Ligand
BDBM150970
Substrate
Meas. Tech.
FLIPR-3 Calcium Assay
IC50
>10000±n/a nM
Citation
 Maeda, DYZebala, JA Pyridinecarboxamides as CXCR2 modulators US Patent  USRE47267 Publication Date 3/5/2019 
Target
Name:
C-X-C chemokine receptor type 2
Synonyms:
C-X-C chemokine receptor type 2 (CXCR-2) CD_antigen=CD182 CXCR-2 CXCR2_HUMAN GRO/MGSA receptor IL-8 receptor type 2 IL8RB | Interleukin-8 receptor B
Type:
Protein
Mol. Mass.:
40767.88
Organism:
Homo sapiens (Human)
Description:
P25025
Residue:
360
  
Inhibitor
Name:
BDBM150970
Synonyms:
US8981106, 160 | USRE47267, Compound 160
Type:
Small organic molecule
Emp. Form.:
C20H17BN2O5S
Mol. Mass.:
408.235
SMILES:
OB(O)c1ccccc1CSc1ccc(cn1)C(=O)Nc1ccc(cc1)C(O)=O
: