Target
Bromodomain-containing protein 4
Ligand
BDBM243273
Substrate
Meas. Tech.
Time Resolved Fluorescence Resonance Energy Transfer (TR-FRET) Assay
IC50
<50±n/a nM
Citation
 Poss, MATortolani, DRPurandare, AVTokarski, JSMussari, CPKamau, MGDodd, DSGavai, AVO Malley, DHuynh, TNVaccaro, WHarikrishnan, LS Carbazole compounds useful as bromodomain inhibitors US Patent  US10053454 Publication Date 8/21/2018 
Target
Name:
Bromodomain-containing protein 4
Synonyms:
BRD4 Bromodomain-containing protein 4 (BRD4) Protein HUNK1
Type:
Protein
Mol. Mass.:
152264.84
Organism:
Homo sapiens (Human)
Description:
O60885
Residue:
1362
  
Inhibitor
Name:
BDBM243273
Synonyms:
3-(3,5-dimethyl-4- isoxazolyl)-9- (methylsulfonyl)-7-(1,4- oxazepan-4-ylcarbonyl)-9H- carbazole-1-carboxamide US10196387, Example 17
Type:
Small organic molecule
Emp. Form.:
C25H26N4O6S
Mol. Mass.:
510.562
SMILES:
Cc1noc(C)c1-c1cc(C(N)=O)c2n(c3cc(ccc3c2c1)C(=O)N1CCCOCC1)S(C)(=O)=O
: