Target
Bromodomain-containing protein 4
Ligand
BDBM243306
Substrate
Meas. Tech.
Time Resolved Fluorescence Resonance Energy Transfer (TR-FRET) Assay
IC50
<500±n/a nM
Citation
 Poss, MATortolani, DRPurandare, AVTokarski, JSMussari, CPKamau, MGDodd, DSGavai, AVO Malley, DHuynh, TNVaccaro, WHarikrishnan, LS Carbazole compounds useful as bromodomain inhibitors US Patent  US10053454 Publication Date 8/21/2018 
Target
Name:
Bromodomain-containing protein 4
Synonyms:
BRD4 Bromodomain-containing protein 4 (BRD4) Protein HUNK1
Type:
Protein
Mol. Mass.:
152264.84
Organism:
Homo sapiens (Human)
Description:
O60885
Residue:
1362
  
Inhibitor
Name:
BDBM243306
Synonyms:
US10053454, Example 50 | US10196387, Example 50
Type:
Small organic molecule
Emp. Form.:
C27H28N4O5
Mol. Mass.:
488.535
SMILES:
Cc1noc(C)c1-c1cc(C(N)=O)c2n(CC3CC3)c3cc(OC(=O)N4CCOCC4)ccc3c2c1
: