Target
Bromodomain-containing protein 4
Ligand
BDBM243328
Substrate
Meas. Tech.
Time Resolved Fluorescence Resonance Energy Transfer (TR-FRET) Assay
IC50
<500±n/a nM
Citation
 Poss, MATortolani, DRPurandare, AVTokarski, JSMussari, CPKamau, MGDodd, DSGavai, AVO Malley, DHuynh, TNVaccaro, WHarikrishnan, LS Carbazole compounds useful as bromodomain inhibitors US Patent  US10053454 Publication Date 8/21/2018 
Target
Name:
Bromodomain-containing protein 4
Synonyms:
BRD4 Bromodomain-containing protein 4 (BRD4) Protein HUNK1
Type:
Protein
Mol. Mass.:
152264.84
Organism:
Homo sapiens (Human)
Description:
O60885
Residue:
1362
  
Inhibitor
Name:
BDBM243328
Synonyms:
US10053454, Example 72 | US10196387, Example 72
Type:
Small organic molecule
Emp. Form.:
C20H19N3O5S
Mol. Mass.:
413.447
SMILES:
COc1ccc2n(c3c(cc(cc3c2c1)-c1c(C)noc1C)C(N)=O)S(C)(=O)=O
: