Target
Cathepsin S
Ligand
BDBM19581
Substrate
BDBM19546
Meas. Tech.
Enzyme Inhibition Assay
Ki
7.1±n/a nM
Citation
 Liu, HTully, DCEpple, RBursulaya, BLi, JHarris, JLWilliams, JARusso, RTumanut, CRoberts, MJAlper, PBHe, YKaranewsky, DS Design and synthesis of arylaminoethyl amides as noncovalent inhibitors of cathepsin S. Part 1. Bioorg Med Chem Lett 15:4979-84 (2005)  
Target
Name:
Cathepsin S
Synonyms:
CATS_HUMAN Cathepsin S (Cat S) | cathepsin S preproprotein
Type:
Protein
Mol. Mass.:
37507.38
Organism:
Homo sapiens (Human)
Description:
P25774
Residue:
331
  
Inhibitor
Name:
BDBM19581
Synonyms:
(2S)-2-{[5-(4-chlorophenyl)furan-2-yl]formamido}-3-cyclohexyl-N-{2-[(4-methoxyphenyl)amino]ethyl}propanamide | arylaminoethyl amide, 19
Type:
Small organic molecule
Emp. Form.:
C29H34ClN3O4
Mol. Mass.:
524.051
SMILES:
COc1ccc(NCCNC(=O)[C@H](CC2CCCCC2)NC(=O)c2ccc(o2)-c2ccc(Cl)cc2)cc1
:
Substrate
Name:
BDBM19546
Synonyms:
7-amino-3-carbamoylmethyl-4-methyl coumarin labeled fluorescent peptide | Ac-His-Pro-Val-Lys-ACMC
Type:
Emp. Form.:
Mol. Mass.:
SMILES:
: