Target
Plasma kallikrein
Ligand
BDBM187093
Substrate
Meas. Tech.
Inhibition Assay
IC50
3.00±n/a nM
Citation
 Allan, CEBatt, ARDavie, RLEdwards, HJEvans, DMPethen, SJ Benzylamine derivatives US Patent  US9834513 Publication Date 12/5/2017 
Target
Name:
Plasma kallikrein
Synonyms:
Fletcher factor KLKB1 Kallikrein Plasma kallikrein heavy chain Plasma prekallikrein
Type:
Protein
Mol. Mass.:
71391.16
Organism:
Homo sapiens (Human)
Description:
P03952
Residue:
638
  
Inhibitor
Name:
BDBM187093
Synonyms:
US9670157, 107 1-[4-(4-Methyl-pyrazol-1-ylmethyl)-benzyl]-1H-imidazole-4-carboxylic acid 4-aminomethyl-2-methyl-benzylamide | US9834513, 107
Type:
Small organic molecule
Emp. Form.:
C25H28N6O
Mol. Mass.:
428.5294
SMILES:
Cc1cnn(Cc2ccc(Cn3cnc(c3)C(=O)NCc3ccc(CN)cc3C)cc2)c1
: