Target
Procathepsin L
Ligand
BDBM19594
Substrate
BDBM19584
Meas. Tech.
Enzyme Inhibition Assay
Ki
150±n/a nM
Citation
 Alper, PBLiu, HChatterjee, AKNguyen, KTTully, DCTumanut, CLi, JHarris, JLTuntland, TChang, JGordon, PHollenbeck, TKaranewsky, DS Arylaminoethyl amides as noncovalent inhibitors of cathepsin S. Part 2: Optimization of P1 and N-aryl. Bioorg Med Chem Lett 16:1486-90 (2006)  
Target
Name:
Procathepsin L
Synonyms:
CATL1_HUMAN CTSL CTSL1 Cathepsin L Cathepsin L1 heavy chain MEP cathepsin L preproprotein
Type:
Enzyme
Mol. Mass.:
37557.19
Organism:
Homo sapiens (Human)
Description:
Purchased from Calbiochem (San Diego, CA).
Residue:
333
  
Inhibitor
Name:
BDBM19594
Synonyms:
(2S)-4-cyclohexyl-N-[(2S)-1-(5-fluoro-2,3-dihydro-1H-indol-1-yl)-3-methylbutan-2-yl]-2-[(3-methoxyphenyl)formamido]butanamide | arylaminoethyl amide, 8b
Type:
Small organic molecule
Emp. Form.:
C31H42FN3O3
Mol. Mass.:
523.6819
SMILES:
COc1cccc(c1)C(=O)N[C@@H](CCC1CCCCC1)C(=O)N[C@H](CN1CCc2cc(F)ccc12)C(C)C
:
Substrate
Name:
BDBM19584
Synonyms:
7-amino-3-carbamoylmethyl-4-methyl coumarin labeled fluorescent peptide | Ac-His-Lys-Phe-Lys-ACMC
Type:
Emp. Form.:
Mol. Mass.:
SMILES:
: