Target
Tyrosine-protein kinase JAK3
Ligand
BDBM195774
Substrate
Meas. Tech.
In Vitro Inhibition Assay
IC50
<100±n/a nM
Citation
 Vankayalapati, HYerramreddy, VGangireddy, PAppalaneni, RP Substituted pyrrolo[2,3-b]pyrazines and substituted pyrazolo[3,4-b]pyridines as ITK and JAK kinase inhibitors US Patent  US9834551 Publication Date 12/5/2017 
Target
Name:
Tyrosine-protein kinase JAK3
Synonyms:
JAK-3 JAK3_HUMAN Janus kinase 3 (JAK3) L-JAK | Leukocyte janus kinase
Type:
Protein
Mol. Mass.:
125111.08
Organism:
Homo sapiens (Human)
Description:
P52333
Residue:
1124
  
Inhibitor
Name:
BDBM195774
Synonyms:
US9206188, 25 | US9834551, Example 25
Type:
Small organic molecule
Emp. Form.:
C16H14FN3O
Mol. Mass.:
283.3003
SMILES:
Cc1c[nH]c2ncc(cc12)-c1cccc(NC(=O)CF)c1
: