Target
Tyrosine-protein kinase ITK/TSK
Ligand
BDBM362411
Substrate
Meas. Tech.
In Vitro Inhibition Assay
IC50
>100±n/a nM
Citation
 Vankayalapati, HYerramreddy, VGangireddy, PAppalaneni, RP Substituted pyrrolo[2,3-b]pyrazines and substituted pyrazolo[3,4-b]pyridines as ITK and JAK kinase inhibitors US Patent  US9834551 Publication Date 12/5/2017 
Target
Name:
Tyrosine-protein kinase ITK/TSK
Synonyms:
EMT ITK_HUMAN LYK Tyrosine-protein kinase ITK Tyrosine-protein kinase Lyk
Type:
Protein
Mol. Mass.:
71839.20
Organism:
Homo sapiens (Human)
Description:
Q08881
Residue:
620
  
Inhibitor
Name:
BDBM362411
Synonyms:
N-(3-(3-methyl-1H-pyrrolo[2,3- b]pyridin-5- yl)phenyl)propiolamide | US9834551, Example 70
Type:
Small organic molecule
Emp. Form.:
C17H13N3O
Mol. Mass.:
275.3046
SMILES:
Cc1c[nH]c2ncc(cc12)-c1cccc(NC(=O)C#C)c1
: