Target
Tyrosine-protein kinase ITK/TSK
Ligand
BDBM195826
Substrate
Meas. Tech.
In Vitro Inhibition Assay
IC50
<100±n/a nM
Citation
 Vankayalapati, HYerramreddy, VGangireddy, PAppalaneni, RP Substituted pyrrolo[2,3-b]pyrazines and substituted pyrazolo[3,4-b]pyridines as ITK and JAK kinase inhibitors US Patent  US9834551 Publication Date 12/5/2017 
Target
Name:
Tyrosine-protein kinase ITK/TSK
Synonyms:
EMT ITK_HUMAN LYK Tyrosine-protein kinase ITK Tyrosine-protein kinase Lyk
Type:
Protein
Mol. Mass.:
71839.20
Organism:
Homo sapiens (Human)
Description:
Q08881
Residue:
620
  
Inhibitor
Name:
BDBM195826
Synonyms:
US9206188, 77 | US9834551, Example 77
Type:
Small organic molecule
Emp. Form.:
C15H10N4O
Mol. Mass.:
262.2661
SMILES:
O=C(Nc1cccc(n1)-c1cnc2[nH]ccc2c1)C#C
: