Target
Tyrosine-protein kinase BTK
Ligand
BDBM362426
Substrate
Meas. Tech.
Enzyme Activity Assay
IC50
1.10±n/a nM
Citation
 Liu, JKim, RMKozlowski, JGuiadeen, DKrikorian, ADYu, Y BTK inhibitors US Patent  US9834554 Publication Date 12/5/2017 
Target
Name:
Tyrosine-protein kinase BTK
Synonyms:
AGMX1 Agammaglobulinaemia tyrosine kinase B cell progenitor kinase BPK BTK_HUMAN Tyrosine Kinase BTK Tyrosine-protein kinase BTK (BTK)
Type:
Enzyme
Mol. Mass.:
76289.95
Organism:
Homo sapiens (Human)
Description:
Q06187
Residue:
659
  
Inhibitor
Name:
BDBM362426
Synonyms:
4-{7-amino-3- [(6R,8aS)-3- oxooctahydroindolizin- 6-yl]-1H-pyrazolo[3,4-c] pyridin-1-yl}- 3-methoxy-N-[4- (trifluoromethyl)pyridin-2-yl] benzamide | US9834554, Example 40
Type:
Small organic molecule
Emp. Form.:
C28H26F3N7O3
Mol. Mass.:
565.5463
SMILES:
COc1cc(ccc1-n1nc([C@@H]2CC[C@H]3CCC(=O)N3C2)c2ccnc(N)c12)C(=O)Nc1cc(ccn1)C(F)(F)F
: