Target
Tyrosine-protein kinase SYK
Ligand
BDBM243353
Substrate
Meas. Tech.
In Vitro SYK Inhibition Assay
pH
7.8±n/a
Temperature
298.15±n/a K
IC50
<500±n/a nM
Comments
extracted
Citation
 Benjahad, AMartin, JSchalon, CPez, DChevenier, ESandrinelli, FPicoul, WMoussy, A Diazaspiroalkaneone-substituted oxazole derivatives as spleen tyrosine kinase inhibitors US Patent  US10053455 Publication Date 8/21/2018 
Target
Name:
Tyrosine-protein kinase SYK
Synonyms:
KSYK_HUMAN Spleen Tyrosine Kinase Tyrosine-protein kinase SYK (Syk)
Type:
Enzyme
Mol. Mass.:
72079.99
Organism:
Homo sapiens (Human)
Description:
P43405
Residue:
635
  
Inhibitor
Name:
BDBM243353
Synonyms:
6-{5-[3-(4-Methyl- pyrimidin-2-ylamino)- phenyl]-oxazol-2-yl}-6,9- diaza-spiro[4.5]decan- 10-one | US10053455, 009
Type:
Small organic molecule
Emp. Form.:
C22H24N6O2
Mol. Mass.:
404.465
SMILES:
Cc1ccnc(Nc2cccc(c2)-c2cnc(o2)N2CCNC(=O)C22CCCC2)n1
: