Target
Cathepsin S
Ligand
BDBM19655
Substrate
BDBM19546
Meas. Tech.
Enzyme Inhibition Assay
pH
5.5±n/a
Temperature
310.15±n/a K
Ki
11±n/a nM
Citation
 Chatterjee, AKLiu, HTully, DCGuo, JEpple, RRusso, RWilliams, JRoberts, MTuntland, TChang, JGordon, PHollenbeck, TTumanut, CLi, JHarris, JL Synthesis and SAR of succinamide peptidomimetic inhibitors of cathepsin S. Bioorg Med Chem Lett 17:2899-903 (2007)  
Target
Name:
Cathepsin S
Synonyms:
CATS_HUMAN Cathepsin S (Cat S) | cathepsin S preproprotein
Type:
Protein
Mol. Mass.:
37507.38
Organism:
Homo sapiens (Human)
Description:
P25774
Residue:
331
  
Inhibitor
Name:
BDBM19655
Synonyms:
(2R)-2-(2-cyclopentylethyl)-N-[(2S)-3-methyl-1-{[4-(trifluoromethoxy)phenyl]amino}butan-2-yl]-4-(morpholin-4-yl)-4-oxobutanamide | succinamide peptidomimetic, 21
Type:
Small organic molecule
Emp. Form.:
C27H40F3N3O4
Mol. Mass.:
527.6194
SMILES:
CC(C)[C@@H](CNc1ccc(OC(F)(F)F)cc1)NC(=O)[C@H](CCC1CCCC1)CC(=O)N1CCOCC1
:
Substrate
Name:
BDBM19546
Synonyms:
7-amino-3-carbamoylmethyl-4-methyl coumarin labeled fluorescent peptide | Ac-His-Pro-Val-Lys-ACMC
Type:
Emp. Form.:
Mol. Mass.:
SMILES:
: