Target
Cathepsin K
Ligand
BDBM19644
Substrate
BDBM19583
Meas. Tech.
Enzyme Inhibition Assay
Ki
907±n/a nM
Citation
 Chatterjee, AKLiu, HTully, DCGuo, JEpple, RRusso, RWilliams, JRoberts, MTuntland, TChang, JGordon, PHollenbeck, TTumanut, CLi, JHarris, JL Synthesis and SAR of succinamide peptidomimetic inhibitors of cathepsin S. Bioorg Med Chem Lett 17:2899-903 (2007)  
Target
Name:
Cathepsin K
Synonyms:
CATK_HUMAN CTSO Cathepsin O Cathepsin X
Type:
Enzyme
Mol. Mass.:
36975.68
Organism:
Homo sapiens (Human)
Description:
P43235
Residue:
329
  
Inhibitor
Name:
BDBM19644
Synonyms:
(2R)-2-(cyclohexylmethyl)-4-(morpholin-4-yl)-4-oxo-N-[(2S)-1-{[4-(trifluoromethoxy)phenyl]amino}butan-2-yl]butanamide | succinamide peptidomimetic, 10
Type:
Small organic molecule
Emp. Form.:
C26H38F3N3O4
Mol. Mass.:
513.5928
SMILES:
CC[C@@H](CNc1ccc(OC(F)(F)F)cc1)NC(=O)[C@H](CC1CCCCC1)CC(=O)N1CCOCC1
:
Substrate
Name:
BDBM19583
Synonyms:
7-amino-3-carbamoylmethyl-4-methyl coumarin labeled fluorescent peptide | Ac-Lys-His-Pro-Lys-ACMC
Type:
Emp. Form.:
Mol. Mass.:
SMILES:
: