Target
Procathepsin L
Ligand
BDBM19643
Substrate
BDBM19584
Meas. Tech.
Enzyme Inhibition Assay
Ki
18900±n/a nM
Citation
 Chatterjee, AKLiu, HTully, DCGuo, JEpple, RRusso, RWilliams, JRoberts, MTuntland, TChang, JGordon, PHollenbeck, TTumanut, CLi, JHarris, JL Synthesis and SAR of succinamide peptidomimetic inhibitors of cathepsin S. Bioorg Med Chem Lett 17:2899-903 (2007)  
Target
Name:
Procathepsin L
Synonyms:
CATL1_HUMAN CTSL CTSL1 Cathepsin L Cathepsin L1 heavy chain MEP cathepsin L preproprotein
Type:
Enzyme
Mol. Mass.:
37557.19
Organism:
Homo sapiens (Human)
Description:
Purchased from Calbiochem (San Diego, CA).
Residue:
333
  
Inhibitor
Name:
BDBM19643
Synonyms:
(2R)-2-(cyclohexylmethyl)-4-(morpholin-4-yl)-4-oxo-N-[(2S)-1-{[4-(trifluoromethoxy)phenyl]amino}propan-2-yl]butanamide | succinamide peptidomimetic, 9
Type:
Small organic molecule
Emp. Form.:
C25H36F3N3O4
Mol. Mass.:
499.5662
SMILES:
C[C@@H](CNc1ccc(OC(F)(F)F)cc1)NC(=O)[C@H](CC1CCCCC1)CC(=O)N1CCOCC1
:
Substrate
Name:
BDBM19584
Synonyms:
7-amino-3-carbamoylmethyl-4-methyl coumarin labeled fluorescent peptide | Ac-His-Lys-Phe-Lys-ACMC
Type:
Emp. Form.:
Mol. Mass.:
SMILES:
: