Target
Bromodomain-containing protein 4 [42-168]
Ligand
BDBM362428
Substrate
Meas. Tech.
AlphaScreen Assay
IC50
<25±n/a nM
Citation
 Combs, APSparks, RB Tricyclic heterocycles as bet protein inhibitors US Patent  US9834565 Publication Date 12/5/2017 
Target
Name:
Bromodomain-containing protein 4 [42-168]
Synonyms:
BRD4 BRD4_HUMAN HUNK1
Type:
Enzyme Catalytic Domain
Mol. Mass.:
15054.68
Organism:
Homo sapiens (Human)
Description:
O60885[42-168]
Residue:
127
  
Inhibitor
Name:
BDBM362428
Synonyms:
(4S)-7-(3,5-Dimethylisoxazol-4-yl)-2-(4-isobutyrylpiperazin-1-yl)-4-pyridin-2-yl-4,5-dihydroimidazo[1,5,4-de][1,4]benzoxazine US10618910, Example 1 | US9834565, Example 1
Type:
Small organic molecule
Emp. Form.:
C27H30N6O3
Mol. Mass.:
486.5655
SMILES:
CC(C)C(=O)N1CCN(CC1)c1nc2ccc(-c3c(C)noc3C)c3OC[C@H](c4ccccn4)n1c23
: