Target
Bromodomain-containing protein 4 [42-168]
Ligand
BDBM362665
Substrate
Meas. Tech.
AlphaScreen Assay
IC50
<25±n/a nM
Citation
 Combs, APSparks, RB Tricyclic heterocycles as bet protein inhibitors US Patent  US9834565 Publication Date 12/5/2017 
Target
Name:
Bromodomain-containing protein 4 [42-168]
Synonyms:
BRD4 BRD4_HUMAN HUNK1
Type:
Enzyme Catalytic Domain
Mol. Mass.:
15054.68
Organism:
Homo sapiens (Human)
Description:
O60885[42-168]
Residue:
127
  
Inhibitor
Name:
BDBM362665
Synonyms:
N-{1-[(4S)-7-(3,5-dimethylisoxazol-4-yl)- 4-pyridin-2-yl-4,5-dihydroimidazo[1,5,4- de][1,4]benzoxazin-2-yl]piperidin-4-yl}-N- methylcyclobutanecarboxamide US9834565, Example 20
Type:
Small organic molecule
Emp. Form.:
C30H34N6O3
Mol. Mass.:
526.6294
SMILES:
CN(C1CCN(CC1)c1nc2ccc(-c3c(C)noc3C)c3OCC(c4ccccn4)n1c23)C(=O)C1CCC1
: