Target
Bromodomain-containing protein 4 [42-168]
Ligand
BDBM362672
Substrate
Meas. Tech.
AlphaScreen Assay
IC50
<25±n/a nM
Citation
 Combs, APSparks, RB Tricyclic heterocycles as bet protein inhibitors US Patent  US9834565 Publication Date 12/5/2017 
Target
Name:
Bromodomain-containing protein 4 [42-168]
Synonyms:
BRD4 BRD4_HUMAN HUNK1
Type:
Enzyme Catalytic Domain
Mol. Mass.:
15054.68
Organism:
Homo sapiens (Human)
Description:
O60885[42-168]
Residue:
127
  
Inhibitor
Name:
BDBM362672
Synonyms:
(4S)-2-[4-(cyclopropylcarbonyl)piperazin- 1-yl]-7-(3,5-dimethylisoxazol-4-yl)-4- pyridin-2-yl-4,5-dihydroimidazo[1,5,4- de][1,4]benzoxazine US10618910, Example 26 | US9834565, Example 27
Type:
Small organic molecule
Emp. Form.:
C27H28N6O3
Mol. Mass.:
484.5496
SMILES:
Cc1noc(C)c1-c1ccc2nc(N3CCN(CC3)C(=O)C3CC3)n3[C@H](COc1c23)c1ccccn1
: