Target
Phosphatidylinositol 4,5-bisphosphate 3-kinase catalytic subunit gamma isoform
Ligand
BDBM362679
Substrate
Meas. Tech.
Biochemical Assay
IC50
85.0±n/a nM
Citation
 Du, ZHintermann, SHurth, KJacquier, SLehmann, HMoebitz, HSoldermann, NStojanovic, A Substituted quinazolin-4-one derivatives US Patent  US9840498 Publication Date 12/12/2017 
Target
Name:
Phosphatidylinositol 4,5-bisphosphate 3-kinase catalytic subunit gamma isoform
Synonyms:
PI3-kinase p110 subunit gamma PI3Kgamma PK3CG_HUMAN Phosphatidylinositol 4,5-bisphosphate 3-kinase (PI3K) Phosphatidylinositol 4,5-bisphosphate 3-kinase catalytic subunit gamma (PI3Kgamma) Phosphatidylinositol 4,5-bisphosphate 3-kinase catalytic subunit gamma isoform (PI3K) Phosphatidylinositol-4,5-bisphosphate 3-kinase catalytic subunit gamma isoform Phosphoinositide 3-kinases gamma (PI3K gamma) p120-PI3K
Type:
Enzyme Subunit
Mol. Mass.:
126470.30
Organism:
Homo sapiens (Human)
Description:
P48736
Residue:
1102
  
Inhibitor
Name:
BDBM362679
Synonyms:
US9840498, 5
Type:
Small organic molecule
Emp. Form.:
C27H22FN9O
Mol. Mass.:
507.5217
SMILES:
Cn1cc(cn1)-c1c(F)ccc2nc([C@@H]3CCCN3c3ncnc(N)c3C#N)n(-c3ccccc3)c(=O)c12
: