Target
Trace amine-associated receptor 1
Ligand
BDBM362714
Substrate
Meas. Tech.
Radioligand Binding Assay
Ki
4.70±n/a nM
Citation
 Galley, GPflieger, PNorcross, RCecere, GShen, HHu, Y Morpholin-pyridine derivatives US Patent  US9840501 Publication Date 12/12/2017 
Target
Name:
Trace amine-associated receptor 1
Synonyms:
TAAR1_RAT Taar1 Trace amine receptor 1 (TARR1) Trace amine-associated receptor 1 (TAAR1) Trar1
Type:
Enzyme
Mol. Mass.:
38034.73
Organism:
Rattus norvegicus (Rat)
Description:
Q923Y9
Residue:
332
  
Inhibitor
Name:
BDBM362714
Synonyms:
(RS)-1-(3-Chlorophenyl)-3-(6-morpholin-2-yl-3-pyridyl)urea | US9840501, Example 8
Type:
Small organic molecule
Emp. Form.:
C16H17ClN4O2
Mol. Mass.:
332.785
SMILES:
Clc1cccc(NC(=O)Nc2ccc(nc2)C2CNCCO2)c1
: