Target
Trace amine-associated receptor 1
Ligand
BDBM362724
Substrate
Meas. Tech.
Radioligand Binding Assay
Ki
1.50±n/a nM
Citation
 Galley, GPflieger, PNorcross, RCecere, GShen, HHu, Y Morpholin-pyridine derivatives US Patent  US9840501 Publication Date 12/12/2017 
Target
Name:
Trace amine-associated receptor 1
Synonyms:
TAAR1_MOUSE Taar1 Trace amine receptor 1 (TARR1) Trace amine-associated receptor1 | Trar1
Type:
Protein
Mol. Mass.:
37635.41
Organism:
Mus musculus (Mouse)
Description:
Q923Y8
Residue:
332
  
Inhibitor
Name:
BDBM362724
Synonyms:
N-(4-Chlorophenyl)-6-[(2S)-morpholin-2-yl]pyridin-3-amine | US9840501, Example 18
Type:
Small organic molecule
Emp. Form.:
C15H16ClN3O
Mol. Mass.:
289.76
SMILES:
Clc1ccc(Nc2ccc(nc2)[C@@H]2CNCCO2)cc1
: