Target
Trace amine-associated receptor 1
Ligand
BDBM362748
Substrate
Meas. Tech.
Radioligand Binding Assay
Ki
3.80±n/a nM
Citation
 Galley, GPflieger, PNorcross, RCecere, GShen, HHu, Y Morpholin-pyridine derivatives US Patent  US9840501 Publication Date 12/12/2017 
Target
Name:
Trace amine-associated receptor 1
Synonyms:
TAAR1_MOUSE Taar1 Trace amine receptor 1 (TARR1) Trace amine-associated receptor1 | Trar1
Type:
Protein
Mol. Mass.:
37635.41
Organism:
Mus musculus (Mouse)
Description:
Q923Y8
Residue:
332
  
Inhibitor
Name:
BDBM362748
Synonyms:
1-[6-[(2S)-Morpholin-2-yl]-3-pyridyl]-3-[3-(trifluoromethyl)phenyl]urea | US9840501, Example 42
Type:
Small organic molecule
Emp. Form.:
C17H17F3N4O2
Mol. Mass.:
366.3377
SMILES:
FC(F)(F)c1cccc(NC(=O)Nc2ccc(nc2)[C@@H]2CNCCO2)c1
: