Target
Tyrosine-protein kinase receptor TYRO3
Ligand
BDBM362832
Substrate
Meas. Tech.
TAM Enzymatic Assay
IC50
550±n/a nM
Citation
 Sun, YLi, YBurns, DM Heterocyclic compounds and uses thereof US Patent  US9840503 Publication Date 12/12/2017 
Target
Name:
Tyrosine-protein kinase receptor TYRO3
Synonyms:
BYK RSE TIF TYRO3_HUMAN | Tyrosine-protein kinase SKY
Type:
Protein
Mol. Mass.:
96894.13
Organism:
Homo sapiens (Human)
Description:
Q06418
Residue:
890
  
Inhibitor
Name:
BDBM362832
Synonyms:
3-(Butylamino)-5-(trans-4-hydroxycyclohexyl)-8-{[(2-hydroxyethyl)amino]methyl}pyrimido [4,5-c]isoquinolin-6(5H)-one | US9840503, Example 5
Type:
Small organic molecule
Emp. Form.:
C24H33N5O3
Mol. Mass.:
439.5505
SMILES:
CCCCNc1ncc2c3ccc(CNCCO)cc3c(=O)n([C@H]3CC[C@H](O)CC3)c2n1
: