Target
Tyrosine-protein kinase receptor TYRO3
Ligand
BDBM362834
Substrate
Meas. Tech.
TAM Enzymatic Assay
IC50
550±n/a nM
Citation
 Sun, YLi, YBurns, DM Heterocyclic compounds and uses thereof US Patent  US9840503 Publication Date 12/12/2017 
Target
Name:
Tyrosine-protein kinase receptor TYRO3
Synonyms:
BYK RSE TIF TYRO3_HUMAN | Tyrosine-protein kinase SKY
Type:
Protein
Mol. Mass.:
96894.13
Organism:
Homo sapiens (Human)
Description:
Q06418
Residue:
890
  
Inhibitor
Name:
BDBM362834
Synonyms:
3-(Butylamino)-5-(trans-4-hydroxycyclohexyl)-8-(1-methyl-1H-pyrazol-4-yl)pyrimido[4,5-c]isoquinolin-6(5H)-one | US9840503, Example 7
Type:
Small organic molecule
Emp. Form.:
C25H30N6O2
Mol. Mass.:
446.5447
SMILES:
CCCCNc1ncc2c3ccc(cc3c(=O)n([C@H]3CC[C@H](O)CC3)c2n1)-c1cnn(C)c1
: