Target
Neuromedin-K receptor
Ligand
BDBM362843
Substrate
Meas. Tech.
Binding Competition Assay
IC50
52.0±n/a nM
Citation
 Hoveyda, HDutheuil, GFraser, G N-acyl-(3-substituted)-(8-methyl)-5,6-dihydro-[1,2,4]triazolo[4,3-a] pyrazines as selective NK-3 receptor antagonists, pharmaceutical composition, methods for use in NK-3 receptor-mediated disorders US Patent  US9840508 Publication Date 12/12/2017 
Target
Name:
Neuromedin-K receptor
Synonyms:
NK-3 receptor NK3R NKR Neurokinin B receptor Neuromedin-3 receptor (NK-3R) Neuromedin-K receptor Neuromedin-K receptor (NK3) TAC3R Tachykinin receptor 3 | Tachykinin receptor 3 (NK3)
Type:
Enzyme
Mol. Mass.:
52221.96
Organism:
Homo sapiens (Human)
Description:
P29371
Residue:
465
  
Inhibitor
Name:
BDBM362843
Synonyms:
(R)-(3,4-difluorophenyl)(8- methyl-3-(5-methylfuran-2- yl)-5,6-dihydro- [1,2,4]triazolo[4,3-a]pyrazin- 7(8H)-yl)methanone | US9840508, Compound 5
Type:
Small organic molecule
Emp. Form.:
C18H16F2N4O2
Mol. Mass.:
358.342
SMILES:
C[C@H]1N(CCn2c1nnc2-c1ccc(C)o1)C(=O)c1ccc(F)c(F)c1
: