Target
Amine oxidase [flavin-containing] A
Ligand
BDBM256625
Substrate
Meas. Tech.
MAO-A Inhibitory Activity
pH
7.5±n/a
Temperature
298.15±n/a K
IC50
>100000±n/a nM
Comments
extracted
Citation
 Matsumoto, SHattori, YToyofuku, MMorimoto, SDaini, MKojima, TKaku, TIto, M Cyclopropanamine compound and use thereof US Patent  US10053456 Publication Date 8/21/2018 
Target
Name:
Amine oxidase [flavin-containing] A
Synonyms:
AOFA_HUMAN MAO-A Monoamine oxidase Monoamine oxidase type A (MAO A) Monoamine oxidase type A (MAOA)
Type:
Protein
Mol. Mass.:
59689.53
Organism:
Homo sapiens (Human)
Description:
P21397
Residue:
527
  
Inhibitor
Name:
BDBM256625
Synonyms:
US10053456, 4 US10968213, Example 4 US9718814, 4 | US9920047, 4
Type:
Small organic molecule
Emp. Form.:
C14H20F2N4O
Mol. Mass.:
298.3316
SMILES:
Cn1nc(cc1C1CC1N)C(=O)NC1CCC(F)(F)CC1
: