Target
Amine oxidase [flavin-containing] B
Ligand
BDBM256650
Substrate
Meas. Tech.
MAO-B Inhibitory Activity
pH
7.5±n/a
Temperature
298.15±n/a K
IC50
>100000±n/a nM
Comments
extracted
Citation
 Matsumoto, SHattori, YToyofuku, MMorimoto, SDaini, MKojima, TKaku, TIto, M Cyclopropanamine compound and use thereof US Patent  US10053456 Publication Date 8/21/2018 
Target
Name:
Amine oxidase [flavin-containing] B
Synonyms:
AOFB_HUMAN MAOB Monoamine oxidase type B (MAO B) Monoamine oxidase type B (MAOB)
Type:
Protein
Mol. Mass.:
58768.76
Organism:
Homo sapiens (Human)
Description:
P27338
Residue:
520
  
Inhibitor
Name:
BDBM256650
Synonyms:
US10053456, 29 US10968213, Example 29 US9718814, 29 | US9920047, 29
Type:
Small organic molecule
Emp. Form.:
C19H26F2N2O2S
Mol. Mass.:
384.484
SMILES:
FC1(F)CCC(CC1)NC(=O)c1cc(cs1)C1CC1NC1CCOCC1
: