Target
Amine oxidase [flavin-containing] B
Ligand
BDBM243411
Substrate
Meas. Tech.
MAO-B Inhibitory Activity
pH
7.5±n/a
Temperature
298.15±n/a K
IC50
>100000±n/a nM
Comments
extracted
Citation
 Matsumoto, SHattori, YToyofuku, MMorimoto, SDaini, MKojima, TKaku, TIto, M Cyclopropanamine compound and use thereof US Patent  US10053456 Publication Date 8/21/2018 
Target
Name:
Amine oxidase [flavin-containing] B
Synonyms:
AOFB_HUMAN MAOB Monoamine oxidase type B (MAO B) Monoamine oxidase type B (MAOB)
Type:
Protein
Mol. Mass.:
58768.76
Organism:
Homo sapiens (Human)
Description:
P27338
Residue:
520
  
Inhibitor
Name:
BDBM243411
Synonyms:
5-((1R,2R)-2-(cis- (4-aminocyclohexyl)- amino)cyclopropyl)- N-(4,4- difluorocyclohexyl)- thiophene-3- carboxamide or5-((1R,2R)-2-(trans-(4-aminocyclohexyl)-amino)cyclopropyl)-N-(4,4-difluorocyclohexyl)-thiophene-3-carboxamide US10053456, 46 US10968213, Example 46 US9920047, 46
Type:
Small organic molecule
Emp. Form.:
C20H29F2N3OS
Mol. Mass.:
397.526
SMILES:
NC1CCC(CC1)N[C@@H]1C[C@H]1c1cc(cs1)C(=O)NC1CCC(F)(F)CC1
: