Target
Amine oxidase [flavin-containing] A
Ligand
BDBM256687
Substrate
Meas. Tech.
MAO-A Inhibitory Activity
pH
7.5±n/a
Temperature
298.15±n/a K
IC50
98000±n/a nM
Comments
extracted
Citation
 Matsumoto, SHattori, YToyofuku, MMorimoto, SDaini, MKojima, TKaku, TIto, M Cyclopropanamine compound and use thereof US Patent  US10053456 Publication Date 8/21/2018 
Target
Name:
Amine oxidase [flavin-containing] A
Synonyms:
AOFA_HUMAN MAO-A Monoamine oxidase Monoamine oxidase type A (MAO A) Monoamine oxidase type A (MAOA)
Type:
Protein
Mol. Mass.:
59689.53
Organism:
Homo sapiens (Human)
Description:
P21397
Residue:
527
  
Inhibitor
Name:
BDBM256687
Synonyms:
US10053456, 66 US10968213, Example 66 US9718814, 66
Type:
Small organic molecule
Emp. Form.:
C21H30F2N2O2S
Mol. Mass.:
412.537
SMILES:
Cc1sc(cc1C(=O)NC1CCC(F)(F)CC1)C1CC1NCC1CCOCC1
: