Target
Amine oxidase [flavin-containing] B
Ligand
BDBM244016
Substrate
Meas. Tech.
MAO-B Inhibitory Activity
pH
7.5±n/a
Temperature
298.15±n/a K
IC50
>100000±n/a nM
Comments
extracted
Citation
 Matsumoto, SHattori, YToyofuku, MMorimoto, SDaini, MKojima, TKaku, TIto, M Cyclopropanamine compound and use thereof US Patent  US10053456 Publication Date 8/21/2018 
Target
Name:
Amine oxidase [flavin-containing] B
Synonyms:
AOFB_HUMAN MAOB Monoamine oxidase type B (MAO B) Monoamine oxidase type B (MAOB)
Type:
Protein
Mol. Mass.:
58768.76
Organism:
Homo sapiens (Human)
Description:
P27338
Residue:
520
  
Inhibitor
Name:
BDBM244016
Synonyms:
4-((4-((((1R,2R)-2- (4-((4,4-difluoro- cyclohexyl)- carbamoyl)-2- thienyl)cyclo- propyl)amino)methyl) piperidin-1- yl)methyl)benzoic acid US10414761, Example 101 US9718814, 101 | US9920047, 101
Type:
Small organic molecule
Emp. Form.:
C28H35F2N3O3S
Mol. Mass.:
531.658
SMILES:
OC(=O)c1ccc(CN2CCC(CN[C@@H]3C[C@H]3c3cc(cs3)C(=O)NC3CCC(F)(F)CC3)CC2)cc1
: