Target
Caspase-3
Ligand
BDBM19730
Substrate
Caspase-7 Fluorometric Substrate Ac-Asp-Glu-Val-Asp-AFC
Ki
478±n/a nM
Citation
 Aulabaugh, AKapoor, BHuang, XDollings, PHum, WTBanker, AWood, AEllestad, G Biochemical and biophysical characterization of inhibitor binding to caspase-3 reveals induced asymmetry. Biochemistry 46:9462-71 (2007)  
Target
Name:
Caspase-3
Synonyms:
Apopain CASP3 CPP-32 Caspase 3 Caspase-3 subunit p17 SCA-1 Yama protein | caspase-3 preproprotein
Type:
Hydrolase; heterotetramer of two heterodimers
Mol. Mass.:
31607.55
Organism:
Homo sapiens (Human)
Description:
Residue:
277
  
Inhibitor
Name:
BDBM19730
Synonyms:
3,3-dimethyl-8-{[(2S)-2-(phenoxymethyl)pyrrolidine-1-]sulfonyl}-2H,3H,4H,10H-pyrimido[1,2-a]indol-10-one WAY-208698
Type:
Small organic molecule
Emp. Form.:
C24H27N3O4S
Mol. Mass.:
453.554
SMILES:
CC1(C)CN=C2N(C1)c1ccc(cc1C2=O)S(=O)(=O)N1CCC[C@H]1COc1ccccc1
:
Substrate
Name:
Caspase-7 Fluorometric Substrate Ac-Asp-Glu-Val-Asp-AFC
Synonyms:
Ac-DEVD-AFC Fluorometric Tetrapeptide Ac-DEVD-AMC
Type:
Peptide
Mol. Mass.:
473.41
Organism:
Description:
Molecular Mass of DEVD
Residue:
4
DEVD