Target
Cytochrome P450 11B2, mitochondrial
Ligand
BDBM232942
Substrate
Meas. Tech.
HTRF-Based Assay
IC50
19.1±n/a nM
Citation
 Bennett, DJCai, JCarswell, ECooke, AHoyt, SBLondon, CMacLean, JPark, MKRatcliffe, PXiong, YSamanta, SKKulkarni, BA Pyrazolopyridyl compounds as aldosterone synthase inhibitors US Patent  US9844553 Publication Date 12/19/2017 
Target
Name:
Cytochrome P450 11B2, mitochondrial
Synonyms:
Aldosterone Synthase (CYP11B2) Aldosterone-synthesizing enzyme CYP11B2 Cytochrome P450 11B2 Cytochrome P450 11B2, mitochondrial P-450C18 | Steroid 18-hydroxylase
Type:
Protein
Mol. Mass.:
57582.15
Organism:
Homo sapiens (Human)
Description:
P19099
Residue:
503
  
Inhibitor
Name:
BDBM232942
Synonyms:
US9351973, 12 | US9844553, 12
Type:
Small organic molecule
Emp. Form.:
C13H13FN4O
Mol. Mass.:
260.2669
SMILES:
CN1c2c(C)c(nn2CCC1=O)-c1cncc(F)c1
: